{"text_format":"1","workbook":"xlsx","n_sheets":4,"sheets":["ReadMe!","Materials","Rawmix Optimizer","Rawmix Modifier"],"not_rendered":{"charts":0,"images":21,"macros":1,"external_links":0,"defined_names":162,"comments":0,"pivot_tables":0},"unopened":[],"bounds":{"document_bytes":16777216,"sheet_cells":100000,"rows_first":2000,"rows_last":500,"rows_between":2000,"halvings":0,"cell_chars":16384,"cell_head_chars":4096},"cells_cut":0,"cells_raw":0,"read":"whole","date_system":"1900"}

{"sheet":"ReadMe!","index":0,"n_rows":89,"n_cols":17,"rows_kept":89,"cut":false,"hidden":false,"merged":[]}
["Rawmix Optimizer"]
["Version V7, M. Fisch / (U. Eggenberger), IfG, Uni Bern"]
[]
["This Rawmix Optimizer has been designed as part of the UTF project 559.17.17 "]
[]
["Das Verwertungspotenzial von Kieswaschschlämmen in der Klinkerporduktion"]
[]
["which supported by the Federal Office of Environment, 3063 Ittingen, Switzerland, and carried out by"]
["Jura-Cement Fabriken AG, 5103 Wildegg, Switzerland, and the"]
["Institute of Geological Sciences, University of Bern, 3012 Bern, Switzerland."]
[]
["Purpose:"]
[]
[null,"The goal of Rawmix Optimizer is to find cost-efficient rawmixes that include gravel wash mud as replacements"]
[null,"of conventional rawmaterial (i.e. as secondary raw materials) for the production of cement clinker. "]
[]
[null,"Rawmix Optimizer can also be used for adding any type of secondary raw materials to e.g. brick raw materials, etc.",null,null,null,null,null,null,null,null,null,null,null,null,null,null,"Figure 1. The Rawmix Optimizer part in the \"Rawmix Optimizer\" sheet. "]
[]
[null,"In a first step (sheet \"Rawmix Optimizer\"), the mixture of available materials is optimized, so that chemical constraints"]
[null,"(i.e. chemical composition range) are met and the cost of the resulting mix is minimized. "]
{"$rows_left_out":70}
{"sheet":"Materials","index":1,"n_rows":60,"n_cols":34,"rows_kept":60,"cut":false,"hidden":false,"merged":[[1,8,1,16],[1,17,1,24],[1,25,1,29],[1,30,1,33],[1,5,1,7]]}
["List of Raw Materials"]
[null,null,null,null,"Available","Costs (/t)",null,null,"Chemical Composition",null,null,null,null,null,null,null,null,"Mineralogical Composition",null,null,null,null,null,null,null,null,null,null,null,null,"Clinker Composition"]
["No.","Material Name*","Type*","Comment","amount (t/day)*","Transport*","Material*","Total","Al2O3*","CaO*","Fe2O3*","K2O*","MgO*","Na2O*","SiO2*","SO3*","LOI*","Calcite","Dolomite","Quartz","Fspars","Illite","Chlorite","Smectites","Kaolinite","d10","d20","d50","d80","d90","LSF","SR","AR","Na_eq"]
[1,"KWS01","SecLowCa","Kieswaschschlamm",100,1.1200000000000001,2,{"$f":"IF(OR(F4>0,G4>0),SUM(F4:G4),\"\")","v":3.12},5.0595657733070949,33.579053631541619,2.4694654826239395,1.0218477859133543,2.1998112057856933,1.002688139927479,24.964309103077643,0.3122312679179694,29.07,50.789211467910683,5.1881878708274831,15.526065492096562,7.321436659268989,12.283154296874999,4.9551064948598604,2.6365356445312496,1.3002035637338889,1.077,2.0859999999999999,8.9710000000000001,37.700000000000003,60.241999999999997,{"$f":"IFERROR(((100*J4)/(2.8*O4+1.2*I4+0.65*K4)),\"\")","v":43.284974662007649},{"$f":"IFERROR((O4/(I4+K4)),\"\")","v":3.3157398680490102},{"$f":"IFERROR((I4/K4),\"\")","v":2.048850574712644},{"$f":"IF(OR(L4=\"\",N4=\"\"),\"\",(N4+0.658*L4))","v":1.6750639830584662}]
[2,"KWS02","SecLowCa","Kieswaschschlamm",50,6.4,1,7.4,7.1819305653763035,22.094577088167636,3.4199669358934779,1.344126539920925,2.4973712043501215,1.0832546434155623,41.46908745057813,0.13520799513997472,20.55,33.33295542152284,5.262799873021633,27.844542197632762,8.0098408235454173,16.173945605045329,5.2177253554814991,2.6184469846275125,1.5398820548456598,1.3029999999999999,2.6970000000000001,13.067,45.17,66.617999999999995,{"$f":"IFERROR(((100*J5)/(2.8*O5+1.2*I5+0.65*K5)),\"\")","v":17.403507013400326},{"$f":"IFERROR((O5/(I5+K5)),\"\")","v":3.9114778694673671},{"$f":"IFERROR((I5/K5),\"\")","v":2.1},{"$f":"IF(OR(L5=\"\",N5=\"\"),\"\",(N5+0.658*L5))","v":1.9676899066835309}]
[3,"KWS03","SecLowCa","Kieswaschschlamm",50,5.12,1,6.12,6.1147848929421089,19.084521213322763,1.7999504361617764,1.3794012688342585,1.0681948850118954,1.6435061459159397,53.207880650277559,0.12616475019825535,16.03,29.799101922447264,0.99396604144253686,39.401983254595628,13.992703119883997,11.49981502664042,2.5775447473504389,1.4374768783300524,0.29740900930966602,1.141,2.2850000000000001,15.968999999999999,150.81399999999999,242.91499999999999,12.11794299386359,6.7226354941551545,3.3971962616822426,2.5511521808088817]
[4,"KWS04","SecLowCa","Kieswaschschlamm",80,6.4,1,7.4,12.907952057586574,14.234052535817616,5.0116264826653678,2.2905371896718005,1.6877642450213264,1.2589343501128465,48.325168076835119,9.4721462730788727E-2,13.97,22.15215535638071,0.35958173282116945,23.16794707639778,11.580239009816477,31.861040742234771,3.0782081195186981,6.8963291649858798,0.90442197326064844,1.615,2.9969999999999999,7.8319999999999999,19.591000000000001,32.104999999999997,9.2394372495207016,2.6967803940413262,2.5756013745704465,2.7661078209168912]
[5,"KWS05","SecLowCa","Kieswaschschlamm",40,6.72,1,7.72,5.954252209650301,31.742910034264003,2.4690844122480002,1.2091399538368357,2.1642589089684541,0.36274198615105074,27.959624662880799,0.14767464019864063,27.460831822100761,53.709999999999994,5.66,18.78,7.4099999999999993,8.3573752711496763,3.3363748276726657,1.4182212581344906,0.8980286430431712,1.157,2.2730000000000001,8.702,25.248999999999999,37.128,36.470611201449103,3.3193051539924996,2.4115223360181512,1.1583560757756888]
[6,"KWS06","SecLowCa","Kieswaschschlamm",40,6.72,1,7.72,5.6497905544967413,31.988852689663425,2.3310832493489126,1.1401248291208077,2.0042958779448594,0.78937305048045736,28.183595298202899,0.26142989712324255,27.44,52.928012814472822,4.0151229624045985,18.70112126637143,6.9431357768774156,9.876377303340341,4.0028738635566858,2.3879055375581091,1.1454504754185972,0.996,1.9,7.4710000000000001,26.231000000000002,40.792999999999999,36.680669994712325,3.5313921747042771,2.4236760124610592,1.5395751880419488]
[7,"KWS07","SecLowCa","Kieswaschschlamm",40,7.2,1,8.1999999999999993,7.6926090252563544,24.597831065714399,3.5569636515979735,1.4196991581215337,2.7236619718309858,0.82172804532577903,35.816540717392172,0.11573634441208155,22.9,39.10050274016033,6.3408668870872775,21.577064178631279,6.2650029439739114,18.246982126058324,3.5323289025752578,3.7700376293508926,1.1676513420155217,1.157,2.1789999999999998,7.9580000000000002,27.535,42.628,21.995839557323382,3.1838134430727023,2.162689804772234,1.7558900913697482]
[8,"KWS08","SecLowCa","Kieswaschschlamm",40,7.68,1,8.68,7.6179571184798283,22.790227302803999,2.8791729769663803,1.4518930037573321,2.5004823953598496,0.50099270932120288,40.239600447151254,2.9318666936836296E-2,21.437829430571224,37.22,7.42,25.68,9.625,12.468853470437018,4.2162047121530151,2.4289974293059124,0.57094438810405423,1.163,2.2029999999999998,7.5190000000000001,23.001999999999999,34.874000000000002,18.426188642710333,3.8333906583293382,2.645883793514356,1.4563383057935275]
[9,"KWS09","SecLowCa","Kieswaschschlamm",50,7.68,1,8.68,6.9277749758419107,26.006239546144002,2.5881451981875001,1.2778504566770321,1.2139579338431807,0.40708664548425461,39.854530445531253,1.9602152985399579E-2,21.130601415094389,43.295000000000002,0.78500000000000003,29.91,8.4699999999999989,13.776506024096387,2.1174422460484141,1.0436746987951806,0.38737703106001992,1.407,3.024,10.29,26.619,39.704999999999998,21.388766430154639,4.1881951210878325,2.6767335081097805,1.2479122459777419]
[10,"KWS10","SecLowCa","Kieswaschschlamm",50,8,1,9,9.4095203135076151,16.323325561783818,4.2916181358202294,1.745314251698993,2.7655220993104814,1.4249183987300957,48.1436926434843,0.10960910759462275,15.81,26.225971909304441,4.5767221130338909,31.162216576386559,12.897272422223288,15.151671232876712,4.8051426844170031,4.6832438356164374,0.49794224708984486,1.639,3.1850000000000001,10.138,29.742999999999999,44.734000000000002,10.963838022884747,3.5138461538461536,2.1925343811394891,2.5733351763480332]
[11,"KWS11","SecLowCa","Kieswaschschlamm",50,8.8000000000000007,1,9.8000000000000007,9.7310457749620767,21.41795931114482,4.1129564855298772,1.7868421522262872,1.9558677612206656,1.2773506736860889,40.123460039856042,0.11268373932958568,19.68,34.531433210065842,3.0655271940110036,22.338098674122847,7.7996752953909994,23.907514640511486,4.3215812388302872,3.3589070156090517,0.67726273145847782,1.2829999999999999,2.4849999999999999,7.51,24.65,44.186,16.904951734171064,2.8982558139534884,2.3659491193737767,2.4530928098509861]
[12,"KWS12","SecLowCa","Kieswaschschlamm",10,9.6,1,10.6,9.8259220820930171,17.766294663208001,3.8588015097652799,1.8903028540829501,2.6391184774394816,0.64379879812970042,46.211288035252451,2.8733260878705744E-2,16.380532367301821,28.66,2.9850000000000003,29.175000000000001,11.945,15.641588785046725,5.8847962320294727,4.4610591900311514,0.86255579289264472,1.464,2.7120000000000002,8.2639999999999993,24.248999999999999,37.713000000000001,12.364241898419397,3.3768521318724902,2.5463662894365098,1.8876180761162815]
[13,"KWS13","SecLowCa","Kieswaschschlamm",20,9.6,1,10.6,10.699275672582697,17.256355277566762,4.4021314483588689,2.0710980337993155,2.5406587216242613,1.3290244467902488,45.840862148910354,0.10062014739105984,16.37,27.139074372553537,2.5708035919871057,24.691457517844807,10.926778724384066,21.054090264826556,6.6363288792389463,6.0782693024990673,0.90331155343542835,1.591,2.9670000000000001,8.26,22.913,36.975000000000001,11.97901053838609,3.0355358134369799,2.43047619047619,2.6918069530301985]
[14,"KWS14","SecLowCa","Kieswaschschlamm",50,9.76,1,10.76,8.2801855596526703,24.072130367550852,3.6068990127274887,1.5290115380040443,1.9445890329487332,0.82645033900321163,37.90380397287975,0.24307362911859165,21.78,37.530494566422703,1.9948990907074737,23.987580394766024,5.4213794632956311,22.631953674194964,6.7862652778920385,1.2974912016327989,0.34993633108835559,1.272,2.4089999999999998,7.6459999999999999,23.155999999999999,37.392000000000003,20.32924099752341,3.188654353562006,2.2956521739130435,1.8325399310098729]
[15,"KWS15","SecLowCa","Kieswaschschlamm",50,9.6,1,10.6,5.0798735288939065,29.978449262918001,2.2348465848719998,0.98536153197000453,2.0663892320924369,0.2372520970180205,31.731127909863201,4.3001559919843599E-2,27.152356852821725,48.86,9.3049999999999997,23.494999999999997,4.1550000000000002,10.161498708010337,2.4174697525449544,0.59216192937123169,0.57886961007347815,1.169,2.3199999999999998,9.7690000000000001,35.253999999999998,59.999000000000002,31.099377607740099,4.3379825087424653,2.2730300877385976,0.88561998505428352]
[16,"KWS16","SecLowCa","Kieswaschschlamm",50,9.6,1,10.6,6.0004275536815177,27.873432319820942,2.5737309779078945,1.1570663762352493,3.1374299817148112,0.62229403183421417,32.212431230703125,0.1409247509517291,25.85,42.88250787827478,9.3210573350265733,22.375476224072244,4.0626028879168423,15.726334908558968,3.5501793265203281,0.86646473325393758,1.2153767063763288,1.242,2.448,10.438000000000001,37.323,56.359000000000002,28.135586875549816,3.7569204152249132,2.3314121037463975,1.3836437073970083]
[17,"KWS17","SecLowCa","Kieswaschschlamm",50,11.200000000000001,1,12.200000000000001,9.2669882310984306,21.953648359486447,3.6696950784593434,1.766292796005706,1.6614443651925819,1.3388338088445078,41.027997503566333,0.1048484308131241,19.53,36.881557472604342,0.93844719048729319,24.816973653532294,10.338074143156913,20.560263324873102,5.6949907809974754,0.42869606598984772,0.34104982813958262,1.202,2.3069999999999999,7.95,27.251999999999999,45.555,17.099977070199742,3.1714463840399003,2.5252747252747256,2.5010544686162621]
{"$rows_left_out":41}
{"sheet":"Rawmix Optimizer","index":2,"n_rows":75,"n_cols":30,"rows_kept":75,"cut":false,"hidden":false,"merged":[]}
["Rawmix Optimizer",null,null,null,null,null,null,null,null,null,null,null,null,null,null,null,"Rawmix Requirements and Optimized Result"]
[]
["Material",null,"RAW1","RAW2","RAW3","RAW4","RAW5","RAW6","RAW7","RAW8","KWS01","KWS02","KWS04","KWS05",null,null,"Amount",null,1200,"t/d",null,{"$f":"C73*S3/100","v":1198.2000000000003},"t/d"]
[null,null,null,null,null,null,null,null,null,null,null,null,null,null,null,null,null,"+/-",0.15,{"$f":"\"% (+/-\"&FIXED((C71-C68),1)&\" t)\"","v":"% (+/-1,8 t)"}]
[null,null,null,null,null,null,null,null,null,null,null,null,null,null,null,null,"Chemical Composition",null,"MIN","MAX",null,"RESULT"]
[null,null,{"$f":"IF((_xlfn.IFNA(VLOOKUP(C$3,Materials!$B$4:$AH$53,2,FALSE),0))=0,\"None\",(_xlfn.IFNA(VLOOKUP(C$3,Materials!$B$4:$AH$53,2,FALSE),0)))","v":"PrimHighCa"},{"$f":"IF((_xlfn.IFNA(VLOOKUP(D$3,Materials!$B$4:$AH$53,2,FALSE),0))=0,\"None\",(_xlfn.IFNA(VLOOKUP(D$3,Materials!$B$4:$AH$53,2,FALSE),0)))","v":"PrimHighCa"},{"$f":"IF((_xlfn.IFNA(VLOOKUP(E$3,Materials!$B$4:$AH$53,2,FALSE),0))=0,\"None\",(_xlfn.IFNA(VLOOKUP(E$3,Materials!$B$4:$AH$53,2,FALSE),0)))","v":"PrimHighCa"},{"$f":"IF((_xlfn.IFNA(VLOOKUP(F$3,Materials!$B$4:$AH$53,2,FALSE),0))=0,\"None\",(_xlfn.IFNA(VLOOKUP(F$3,Materials!$B$4:$AH$53,2,FALSE),0)))","v":"PrimHighCa"},{"$f":"IF((_xlfn.IFNA(VLOOKUP(G$3,Materials!$B$4:$AH$53,2,FALSE),0))=0,\"None\",(_xlfn.IFNA(VLOOKUP(G$3,Materials!$B$4:$AH$53,2,FALSE),0)))","v":"PrimHighCa"},{"$f":"IF((_xlfn.IFNA(VLOOKUP(H$3,Materials!$B$4:$AH$53,2,FALSE),0))=0,\"None\",(_xlfn.IFNA(VLOOKUP(H$3,Materials!$B$4:$AH$53,2,FALSE),0)))","v":"PrimHighCa"},{"$f":"IF((_xlfn.IFNA(VLOOKUP(I$3,Materials!$B$4:$AH$53,2,FALSE),0))=0,\"None\",(_xlfn.IFNA(VLOOKUP(I$3,Materials!$B$4:$AH$53,2,FALSE),0)))","v":"PrimLowCa"},{"$f":"IF((_xlfn.IFNA(VLOOKUP(J$3,Materials!$B$4:$AH$53,2,FALSE),0))=0,\"None\",(_xlfn.IFNA(VLOOKUP(J$3,Materials!$B$4:$AH$53,2,FALSE),0)))","v":"PrimLowCa"},{"$f":"IF((_xlfn.IFNA(VLOOKUP(K$3,Materials!$B$4:$AH$53,2,FALSE),0))=0,\"None\",(_xlfn.IFNA(VLOOKUP(K$3,Materials!$B$4:$AH$53,2,FALSE),0)))","v":"SecLowCa"},{"$f":"IF((_xlfn.IFNA(VLOOKUP(L$3,Materials!$B$4:$AH$53,2,FALSE),0))=0,\"None\",(_xlfn.IFNA(VLOOKUP(L$3,Materials!$B$4:$AH$53,2,FALSE),0)))","v":"SecLowCa"},{"$f":"IF((_xlfn.IFNA(VLOOKUP(M$3,Materials!$B$4:$AH$53,2,FALSE),0))=0,\"None\",(_xlfn.IFNA(VLOOKUP(M$3,Materials!$B$4:$AH$53,2,FALSE),0)))","v":"SecLowCa"},{"$f":"IF((_xlfn.IFNA(VLOOKUP(N$3,Materials!$B$4:$AH$53,2,FALSE),0))=0,\"None\",(_xlfn.IFNA(VLOOKUP(N$3,Materials!$B$4:$AH$53,2,FALSE),0)))","v":"SecLowCa"},null,null,null,"Al2O3",3.1,3.5,"%",{"$f":"IFERROR(SUMPRODUCT(C30:N30,$C$17:$N$17)/100,0)","v":3.1000000000000005},"%"]
["Minimum",null,null,null,null,null,null,null,null,null,null,null,null,null,null,null,null,"CaO",41,41.69,"%",41.000000000000007,"%"]
[null,"%",{"$f":"C65/10","v":0},{"$f":"D65/10","v":0},0,0,0,0,0,0,{"$f":"K65/10","v":0},0,0,0,null,null,null,"Fe2O3",1.65,1.71,"%",1.6855011896147778,"%"]
[null,"t",{"$f":"IF((C8*$C$68/100)<C24,C8*$C$68/100,C24)","v":0},{"$f":"IF((D8*$C$68/100)<D24,D8*$C$68/100,D24)","v":0},0,0,0,0,0,0,0,0,0,0,null,null,null,"K2O",0.1,4,"%",1.7060454848058486,"%"]
[null,null,null,null,null,null,null,null,null,null,null,null,null,null,null,null,null,"MgO",0.1,2.8,"%",2.7004072414500917,"%"]
["Maximum",null,null,null,null,null,null,null,null,null,null,null,null,null,null,null,null,"Na2O",0.1,4,"%",1.1684638361137656,"%"]
[null,"%",{"$f":"C66/10","v":100},{"$f":"D66/10","v":100},{"$f":"E66/10","v":100},{"$f":"F66/10","v":100},100,100,100,100,8.3000000000000007,4.2,6.7,3.3,null,null,null,"SiO2",12.9,13.1,"%",13.100000000000001,"%"]
[null,"t",{"$f":"IF((C12*$C$68/100)<C24,C12*$C$68/100,C24)","v":1200},1200,1200,1200,1200,1200,1200,1200,99.6,50,80,39.6,null,null,null,"SO3",0.1,1,"%",1.0000000000000007,"%"]
[null,null,null,null,null,null,null,null,null,null,null,null,null,null,null,null,null,"LOI",33,36,"%",34.324605133521011,"%"]
[null,null,null,null,null,null,null,null,null,null,null,null,null,null,null,null,null,"Sum",99.5,100.5,"%",{"$f":"SUM(V6:V14)","v":99.785022885505498},"%"]
["Rawmix"]
[null,"%",0,0,44.391208182053177,21.19335123513126,0,9.0809623657681975,0,4.1360449080596489,8.3000000000000007,2.7484333089877415,6.7,3.3,null,null,"Mineralogical Composition",null,"MIN","MAX",null,"RESULT"]
[null,"t",{"$f":"C17*$C$68/100","v":0},0,532.69449818463818,254.32021482157515,0,108.97154838921837,0,49.632538896715786,99.6,32.981199707852895,80.400000000000006,39.6,null,null,null,"Calcite",0,100,"%",{"$f":"IFERROR(SUMPRODUCT(C41:N41,$C$17:$N$17)/100,0)","v":34.304611491537223},"%"]
[null,null,null,null,null,null,null,null,null,null,null,null,null,null,null,null,null,"Dolomite",0,100,"%",3.5814335470043521,"%"]
[null,null,{"$f":"Materials!B57&\" \"&FIXED(IF((SUMIF(C6:N6,Materials!B57,'Rawmix Optimizer'!C17:N17))>=100,100,(SUMIF(C6:N6,Materials!B57,'Rawmix Optimizer'!C17:N17))),1)&\" of \"&FIXED(IF((SUMIF(C6:N6,Materials!B57,'Rawmix Optimizer'!C12:N12))>=100,\"100\",(SUMIF(C6:N6,Materials!B57,'Rawmix Optimizer'!C12:N12))),1)&\" % used\"","v":"PrimHighCa 74,7 of 100,0 % used"},null,null,null,{"$f":"Materials!B59&\" \"&FIXED(IF((SUMIF(C6:N6,Materials!B59,'Rawmix Optimizer'!C17:N17))>=100,100,(SUMIF(C6:N6,Materials!B59,'Rawmix Optimizer'!C17:N17))),1)&\" of \"&FIXED(IF((SUMIF(C6:N6,Materials!B59,'Rawmix Optimizer'!C12:N12))>=100,\"100\",(SUMIF(C6:N6,Materials!B59,'Rawmix Optimizer'!C12:N12))),1)&\" % used\"","v":"SecHighCa 0,0 of 0,0 % used"},null,null,null,null,null,"Sum",{"$f":"FIXED(SUM(C17:N17),1)&\" %\"","v":"99,9 %"},null,null,null,"Quartz",0,100,"%",23.274225364477534,"%"]
{"$rows_left_out":56}
{"sheet":"Rawmix Modifier","index":3,"n_rows":75,"n_cols":28,"rows_kept":75,"cut":false,"hidden":false,"merged":[[19,9,20,11]]}
["Manually Optimize Proposed Rawmix",null,null,null,null,null,null,null,null,null,null,null,null,null,null,null,"Rawmix Requirements and Optimized Result"]
[]
["Material",null,"RAW1","RAW2","RAW3","RAW4","RAW5","RAW6","RAW7","RAW8","KWS01","KWS02","KWS04","KWS05",null,null,"Amount",null,{"$f":"'Rawmix Optimizer'!S3","v":1200},"t/d",null,{"$f":"SUM(C18:N18)","v":1198.2000000000005},"t/d"]
[null,null,{"$f":"IF((_xlfn.IFNA(VLOOKUP(C$3,Materials!$B$4:$AH$53,2,FALSE),0))=0,\"None\",(_xlfn.IFNA(VLOOKUP(C$3,Materials!$B$4:$AH$53,2,FALSE),0)))","v":"PrimHighCa"},{"$f":"IF((_xlfn.IFNA(VLOOKUP(D$3,Materials!$B$4:$AH$53,2,FALSE),0))=0,\"None\",(_xlfn.IFNA(VLOOKUP(D$3,Materials!$B$4:$AH$53,2,FALSE),0)))","v":"PrimHighCa"},{"$f":"IF((_xlfn.IFNA(VLOOKUP(E$3,Materials!$B$4:$AH$53,2,FALSE),0))=0,\"None\",(_xlfn.IFNA(VLOOKUP(E$3,Materials!$B$4:$AH$53,2,FALSE),0)))","v":"PrimHighCa"},{"$f":"IF((_xlfn.IFNA(VLOOKUP(F$3,Materials!$B$4:$AH$53,2,FALSE),0))=0,\"None\",(_xlfn.IFNA(VLOOKUP(F$3,Materials!$B$4:$AH$53,2,FALSE),0)))","v":"PrimHighCa"},{"$f":"IF((_xlfn.IFNA(VLOOKUP(G$3,Materials!$B$4:$AH$53,2,FALSE),0))=0,\"None\",(_xlfn.IFNA(VLOOKUP(G$3,Materials!$B$4:$AH$53,2,FALSE),0)))","v":"PrimHighCa"},{"$f":"IF((_xlfn.IFNA(VLOOKUP(H$3,Materials!$B$4:$AH$53,2,FALSE),0))=0,\"None\",(_xlfn.IFNA(VLOOKUP(H$3,Materials!$B$4:$AH$53,2,FALSE),0)))","v":"PrimHighCa"},{"$f":"IF((_xlfn.IFNA(VLOOKUP(I$3,Materials!$B$4:$AH$53,2,FALSE),0))=0,\"None\",(_xlfn.IFNA(VLOOKUP(I$3,Materials!$B$4:$AH$53,2,FALSE),0)))","v":"PrimLowCa"},{"$f":"IF((_xlfn.IFNA(VLOOKUP(J$3,Materials!$B$4:$AH$53,2,FALSE),0))=0,\"None\",(_xlfn.IFNA(VLOOKUP(J$3,Materials!$B$4:$AH$53,2,FALSE),0)))","v":"PrimLowCa"},{"$f":"IF((_xlfn.IFNA(VLOOKUP(K$3,Materials!$B$4:$AH$53,2,FALSE),0))=0,\"None\",(_xlfn.IFNA(VLOOKUP(K$3,Materials!$B$4:$AH$53,2,FALSE),0)))","v":"SecLowCa"},{"$f":"IF((_xlfn.IFNA(VLOOKUP(L$3,Materials!$B$4:$AH$53,2,FALSE),0))=0,\"None\",(_xlfn.IFNA(VLOOKUP(L$3,Materials!$B$4:$AH$53,2,FALSE),0)))","v":"SecLowCa"},{"$f":"IF((_xlfn.IFNA(VLOOKUP(M$3,Materials!$B$4:$AH$53,2,FALSE),0))=0,\"None\",(_xlfn.IFNA(VLOOKUP(M$3,Materials!$B$4:$AH$53,2,FALSE),0)))","v":"SecLowCa"},{"$f":"IF((_xlfn.IFNA(VLOOKUP(N$3,Materials!$B$4:$AH$53,2,FALSE),0))=0,\"None\",(_xlfn.IFNA(VLOOKUP(N$3,Materials!$B$4:$AH$53,2,FALSE),0)))","v":"SecLowCa"},null,null,null,"+/-",{"$f":"'Rawmix Optimizer'!S4","v":0.15},{"$f":"\"% (+/-\"&FIXED((C71-C68),1)&\" t)\"","v":"% (+/-1,8 t)"}]
[null,null,null,null,null,null,null,null,null,null,null,null,null,null,null,null,"Chemical Composition",null,"MIN","MAX",null,"RESULT"]
["Proposed",null,null,null,null,null,null,null,null,null,null,null,null,null,null,null,null,"Al2O3",{"$f":"'Rawmix Optimizer'!S6","v":3.1},{"$f":"'Rawmix Optimizer'!T6","v":3.5},"%",{"$f":"IFERROR(SUMPRODUCT(C30:N30,$C$17:$N$17)/100,0)","v":3.1000000000000005},"%"]
[null,"%",0,0,44.391208182053177,21.19335123513126,0,9.0809623657681975,0,4.1360449080596489,8.3000000000000007,2.7484333089877415,6.7,3.3,null,null,null,"CaO",{"$f":"'Rawmix Optimizer'!S7","v":41},{"$f":"'Rawmix Optimizer'!T7","v":41.69},"%",41.000000000000021,"%"]
[null,"t",0,0,532.69449818463818,254.32021482157515,0,108.97154838921837,0,49.632538896715786,99.6,32.981199707852895,80.400000000000006,39.6,null,null,null,"Fe2O3",{"$f":"'Rawmix Optimizer'!S8","v":1.65},{"$f":"'Rawmix Optimizer'!T8","v":1.71},"%",1.6855011896147776,"%"]
[null,"Available t",{"$f":"C24","v":5000},{"$f":"D24","v":5000},5000,5000,5000,5000,5000,5000,100,50,80,40,null,null,null,"K2O",{"$f":"'Rawmix Optimizer'!S9","v":0.1},{"$f":"'Rawmix Optimizer'!T9","v":4},"%",1.7060454848058491,"%"]
[null,null,null,null,null,null,null,null,null,null,null,null,null,null,null,null,null,"MgO",{"$f":"'Rawmix Optimizer'!S10","v":0.1},{"$f":"'Rawmix Optimizer'!T10","v":2.8},"%",2.7004072414500921,"%"]
[null,null,null,null,null,null,null,null,null,null,null,null,null,null,null,null,null,"Na2O",{"$f":"'Rawmix Optimizer'!S11","v":0.1},{"$f":"'Rawmix Optimizer'!T11","v":4},"%",1.1684638361137656,"%"]
["Modify",null,null,null,null,null,null,null,null,null,null,null,null,null,null,null,null,"SiO2",{"$f":"'Rawmix Optimizer'!S12","v":12.9},{"$f":"'Rawmix Optimizer'!T12","v":13.1},"%",13.100000000000001,"%"]
[null,"Remove/add t",{"$f":"C65","v":0},{"$f":"D65","v":0},0,0,0,0,0,0,0,0,0,0,null,null,null,"SO3",{"$f":"'Rawmix Optimizer'!S13","v":0.1},{"$f":"'Rawmix Optimizer'!T13","v":1},"%",1.0000000000000007,"%"]
[null,null,null,null,null,null,null,null,null,null,null,null,null,null,null,null,null,"LOI",{"$f":"'Rawmix Optimizer'!S14","v":33},{"$f":"'Rawmix Optimizer'!T14","v":36},"%",34.324605133521011,"%"]
[null,null,null,null,null,null,null,null,null,null,null,null,null,null,null,null,null,"Sum",{"$f":"'Rawmix Optimizer'!S15","v":99.5},{"$f":"'Rawmix Optimizer'!T15","v":100.5},"%",{"$f":"SUM(V6:V14)","v":99.785022885505526},"%"]
["Final Rawmix"]
[null,"%",{"$f":"C18*100/$S$3","v":0},{"$f":"D18*100/$S$3","v":0},44.391208182053184,21.19335123513126,0,9.0809623657681975,0,4.1360449080596489,8.3000000000000007,2.7484333089877411,6.7000000000000011,3.3,null,null,"Mineralogical Composition",null,"MIN","MAX",null,"RESULT"]
[null,"t",{"$f":"C8+C13","v":0},{"$f":"D8+D13","v":0},532.69449818463818,254.32021482157515,0,108.97154838921837,0,49.632538896715786,99.6,32.981199707852895,80.400000000000006,39.6,null,null,null,"Calcite",{"$f":"'Rawmix Optimizer'!S18","v":0},{"$f":"'Rawmix Optimizer'!T18","v":100},"%",{"$f":"IFERROR(SUMPRODUCT(C41:N41,$C$17:$N$17)/100,0)","v":34.304611491537223},"%"]
[null,null,null,null,null,null,null,null,null,null,null,null,null,null,null,null,null,"Dolomite",{"$f":"'Rawmix Optimizer'!S19","v":0},{"$f":"'Rawmix Optimizer'!T19","v":100},"%",3.5814335470043517,"%"]
[null,null,{"$f":"Materials!B57&\" \"&FIXED(IF((SUMIF(C4:N4,Materials!B57,'Rawmix Modifier'!C18:N18))>=S3,S3,(SUMIF(C4:N4,Materials!B57,'Rawmix Modifier'!C18:N18))),0)&\" of \"&FIXED(IF((SUMIF(C4:N4,Materials!B57,'Rawmix Modifier'!C9:N9))>=S3,S3,(SUMIF(C4:N4,Materials!B57,'Rawmix Modifier'!C9:N9))),0)&\" t/d used\"","v":"PrimHighCa 896 of 1.200 t/d used"},null,null,null,{"$f":"Materials!B59&\" \"&FIXED(IF((SUMIF(C4:N4,Materials!B59,'Rawmix Modifier'!C18:N18))>=S3,S3,(SUMIF(C4:N4,Materials!B59,'Rawmix Modifier'!C18:N18))),0)&\" of \"&FIXED(IF((SUMIF(C4:N4,Materials!B59,'Rawmix Modifier'!C9:N9))>=S3,S3,(SUMIF(C4:N4,Materials!B59,'Rawmix Modifier'!C9:N9))),0)&\" t/d used\"","v":"SecHighCa 0 of 0 t/d used"},null,null,{"$f":"IF(AND(V3>=C70,V3<=C71),\"Target Amount OK\",IF(V3<C70,\"Add \"&ROUND(C70-V3,0)&\" t!\",IF(V3>C70,\"Remove \"&ROUNDUP(V3-C71,0)&\" t!\",\"OK\")))","v":"Target Amount OK"},null,null,"Sum",{"$f":"FIXED(SUM(C17:N17),1)&\" %\"","v":"99,9 %"},null,null,null,"Quartz",{"$f":"'Rawmix Optimizer'!S20","v":0},{"$f":"'Rawmix Optimizer'!T20","v":100},"%",{"$f":"IFERROR(SUMPRODUCT(C43:N43,$C$17:$N$17)/100,0)","v":23.274225364477537},"%"]
{"$rows_left_out":55}